[Date Prev][Date Next][Thread Prev][Thread Next][Date Index][Thread Index]

[sc-dev] build error



latest git checkout, mac os 10.8.2

2 warnings generated.
[ 26%] Building CXX object lang/CMakeFiles/libsclang.dir/LangPrimSource/PyrSignalPrim.cpp.o
[ 26%] Building CXX object lang/CMakeFiles/libsclang.dir/LangPrimSource/PyrSched.cpp.o
/Users/vnc/sc_dev/supercollider/lang/LangPrimSource/PyrSched.cpp:39:10: fatal error: 
      'boost/chrono.hpp' file not found
#include <boost/chrono.hpp>
         ^
1 error generated.
make[2]: *** [lang/CMakeFiles/libsclang.dir/LangPrimSource/PyrSched.cpp.o] Error 1
make[1]: *** [lang/CMakeFiles/libsclang.dir/all] Error 2
make: *** [all] Error 2


_______________________________________________
sc-dev mailing list

info (subscription, etc.): http://www.beast.bham.ac.uk/research/sc_mailing_lists.shtml
archive: https://listarc.bham.ac.uk/marchives/sc-dev/
search: https://listarc.bham.ac.uk/lists/sc-dev/search/